prot_acc, prot_hit_num,prot_acc,prot_score,prot_mass,prot_matches,pep_query,pep_rank,pep_isbold,pep_exp_mz,pep_exp_mr,pep_exp_z,pep_calc_mr,pep_delta,pep_miss,pep_score,pep_homol,pep_ident,pep_expect,pep_res_before,pep_seq,pep_res_after,pep_var_mod,pep_var_mod_pos,pep_scan_title,RT/min,Predicted,Error,q
PLSL_HUMAN,1,,,,,11969,1,1,618.24,1234.4654,2,1234.5434,-0.078,0,74.23,,21,5.20E-07,R,AECMLQQAER,L,,,,25.2,25.108,-0.092,0.000
PLSL_HUMAN,1,,,,,11971,1,1,618.25,1234.4854,2,1234.5434,-0.058,0,71.06,,23,1.70E-06,R,AECMLQQAER,L,,,,25.1,25.108,0.008,0.000
PLSL_HUMAN,1,,,,,6536,1,1,618.31,1234.6054,2,1234.5434,0.062,0,36.58,,33,0.05,R,AECMLQQAER,L,,,,26.2,25.108,-1.092,0.002
PLSL_HUMAN,1,,,,,8527,1,1,691.76,1381.5054,2,1381.5853,-0.0799,0,57.59,24,26,7.90E-05,R,GSVSDEEMMELR,E,,,,37.8,36.493,-1.307,0.002
PLSL_HUMAN,1,,,,,12113,1,1,691.76,1381.5054,2,1381.5853,-0.0799,0,73.06,,19,4.50E-07,R,GSVSDEEMMELR,E,,,,36.4,36.493,0.093,0.000
PLSL_HUMAN,1,,,,,12114,1,1,691.76,1381.5054,2,1381.5853,-0.0799,0,69.9,,19,9.40E-07,R,GSVSDEEMMELR,E,,,,36.5,36.493,-0.007,0.000
PLSL_HUMAN,1,,,,,12115,1,1,691.77,1381.5254,2,1381.5853,-0.0599,0,73.25,,21,7.00E-07,R,GSVSDEEMMELR,E,,,,36.2,36.493,0.293,0.000
PLSL_HUMAN,1,,,,,12116,1,1,691.77,1381.5254,2,1381.5853,-0.0599,0,70.4,,21,1.30E-06,R,GSVSDEEMMELR,E,,,,35.2,36.493,1.293,0.002
PLSL_HUMAN,1,,,,,12117,1,1,691.77,1381.5254,2,1381.5853,-0.0599,0,77.26,,21,2.80E-07,R,GSVSDEEMMELR,E,,,,35.1,36.493,1.393,0.002
PLSL_HUMAN,1,,,,,8529,1,1,691.78,1381.5454,2,1381.5853,-0.0399,0,56.27,24,25,9.00E-05,R,GSVSDEEMMELR,E,,,,40.6,36.493,-4.107,0.009
PLSL_HUMAN,1,,,,,12118,1,1,691.79,1381.5654,2,1381.5853,-0.0199,0,38.68,23,24,0.0043,R,GSVSDEEMMELR,E,,,,37.5,36.493,-1.007,0.002
PLSL_HUMAN,1,,,,,8534,1,1,691.8,1381.5854,2,1381.5853,0.0001,0,70.02,,26,4.40E-06,R,GSVSDEEMMELR,E,,,,40.6,36.493,-4.107,0.009
PLSL_HUMAN,1,,,,,8535,1,1,691.81,1381.6054,2,1381.5853,0.0201,0,62.21,,26,3.00E-05,R,GSVSDEEMMELR,E,,,,38.1,36.493,-1.607,0.002
PLSL_HUMAN,1,,,,,8536,1,1,691.82,1381.6254,2,1381.5853,0.0401,0,59.39,,27,6.20E-05,R,GSVSDEEMMELR,E,,,,38,36.493,-1.507,0.002
PLSL_HUMAN,1,,,,,8710,1,1,699.78,1397.5454,2,1397.5803,-0.0348,0,70.43,,26,3.70E-06,R,GSVSDEEMMELR,E,Oxidation (M),0.000000010000.0,,35.5,36.629,1.129,0.002
PLSL_HUMAN,1,,,,,8711,1,1,699.79,1397.5654,2,1397.5803,-0.0148,0,53.02,25,26,0.0002,R,GSVSDEEMMELR,E,Oxidation (M),0.000000010000.0,,35.5,36.629,1.129,0.002
NUCL_HUMAN,2,,,,,5681,1,1,589.75,1177.4854,2,1177.5615,-0.076,0,57.97,,25,6.20E-05,K,EVFEDAAEIR,L,,,,39.6,37.195,-2.405,0.005
NUCL_HUMAN,2,,,,,5682,1,1,589.75,1177.4854,2,1177.5615,-0.076,0,47.42,,25,0.00071,K,EVFEDAAEIR,L,,,,38.2,37.195,-1.005,0.002
NUCL_HUMAN,2,,,,,5684,1,1,589.76,1177.5054,2,1177.5615,-0.056,0,55.03,,26,0.00015,K,EVFEDAAEIR,L,,,,36.7,37.195,0.495,0.002
NUCL_HUMAN,2,,,,,5685,1,1,589.76,1177.5054,2,1177.5615,-0.056,0,67.76,,26,7.80E-06,K,EVFEDAAEIR,L,,,,35.7,37.195,1.495,0.002
NUCL_HUMAN,2,,,,,11919,1,1,589.76,1177.5054,2,1177.5615,-0.056,0,75.25,,26,1.40E-06,K,EVFEDAAEIR,L,,,,37.1,37.195,0.095,0.000
NUCL_HUMAN,2,,,,,11920,1,1,589.76,1177.5054,2,1177.5615,-0.056,0,57.24,,26,8.70E-05,K,EVFEDAAEIR,L,,,,35,37.195,2.195,0.003
NUCL_HUMAN,2,,,,,11921,1,1,589.76,1177.5054,2,1177.5615,-0.056,0,64.49,,26,1.60E-05,K,EVFEDAAEIR,L,,,,37.2,37.195,-0.005,0.000
NUCL_HUMAN,2,,,,,5686,1,1,589.77,1177.5254,2,1177.5615,-0.036,0,49.6,,27,0.00061,K,EVFEDAAEIR,L,,,,38.3,37.195,-1.105,0.002
NUCL_HUMAN,2,,,,,5687,1,1,589.77,1177.5254,2,1177.5615,-0.036,0,46.07,,27,0.0014,K,EVFEDAAEIR,L,,,,39.8,37.195,-2.605,0.005
NUCL_HUMAN,2,,,,,11923,1,1,589.77,1177.5254,2,1177.5615,-0.036,0,65.57,,27,1.50E-05,K,EVFEDAAEIR,L,,,,34.1,37.195,3.095,0.006
NUCL_HUMAN,2,,,,,5688,1,1,589.78,1177.5454,2,1177.5615,-0.016,0,40.81,,28,0.0053,K,EVFEDAAEIR,L,,,,39.7,37.195,-2.505,0.005
NUCL_HUMAN,2,,,,,11924,1,1,589.78,1177.5454,2,1177.5615,-0.016,0,41.11,27,28,0.005,K,EVFEDAAEIR,L,,,,35,37.195,2.195,0.003
NUCL_HUMAN,2,,,,,11925,1,1,589.78,1177.5454,2,1177.5615,-0.016,0,67.9,,28,1.00E-05,K,EVFEDAAEIR,L,,,,34.1,37.195,3.095,0.006
NUCL_HUMAN,2,,,,,11926,1,1,589.78,1177.5454,2,1177.5615,-0.016,0,68.36,,28,9.40E-06,K,EVFEDAAEIR,L,,,,33,37.195,4.195,0.009
NUCL_HUMAN,2,,,,,5690,1,1,589.79,1177.5654,2,1177.5615,0.004,0,35.47,,28,0.02,K,EVFEDAAEIR,L,,,,36.8,37.195,0.395,0.000
NUCL_HUMAN,2,,,,,11927,1,1,589.79,1177.5654,2,1177.5615,0.004,0,73.26,,28,3.40E-06,K,EVFEDAAEIR,L,,,,33.1,37.195,4.095,0.009
NUCL_HUMAN,2,,,,,5691,1,1,589.8,1177.5854,2,1177.5615,0.024,0,59.1,,28,9.00E-05,K,EVFEDAAEIR,L,,,,32.9,37.195,4.295,0.009
NUCL_HUMAN,2,,,,,5692,1,1,589.8,1177.5854,2,1177.5615,0.024,0,53.65,,28,0.00032,K,EVFEDAAEIR,L,,,,40.8,37.195,-3.605,0.006
NUCL_HUMAN,2,,,,,11928,1,1,589.8,1177.5854,2,1177.5615,0.024,0,38.24,,28,0.011,K,EVFEDAAEIR,L,,,,39.4,37.195,-2.205,0.003
NUCL_HUMAN,2,,,,,5694,1,1,589.82,1177.6254,2,1177.5615,0.064,0,46.77,,28,0.0016,K,EVFEDAAEIR,L,,,,40.8,37.195,-3.605,0.006
TCPB_HUMAN,3,TCPB_HUMAN,443,57794,12,4549,1,1,549.71,1097.4054,2,1097.5063,-0.1008,0,48.89,14,22,0.00023,K,EAVAMESYAK,A,,,,25.5,26.788,1.288,0.002
TCPB_HUMAN,3,,,,,11846,1,1,549.73,1097.4454,2,1097.5063,-0.0608,0,61.25,19,23,1.90E-05,K,EAVAMESYAK,A,,,,25.5,26.788,1.288,0.002
TCPB_HUMAN,3,,,,,11847,1,1,549.73,1097.4454,2,1097.5063,-0.0608,0,61.08,18,23,1.90E-05,K,EAVAMESYAK,A,,,,25.4,26.788,1.388,0.002
TCPB_HUMAN,3,,,,,4551,1,1,549.77,1097.5254,2,1097.5063,0.0192,0,23.49,,26,0.22,K,EAVAMESYAK,A,,,,25.8,26.788,0.988,0.002
TCPB_HUMAN,3,,,,,7843,1,1,665.77,1329.5254,2,1329.6524,-0.127,0,66.54,,25,7.20E-06,R,GATQQILDEAER,S,,,,34.3,32.634,-1.666,0.002
TCPB_HUMAN,3,,,,,7844,1,1,665.78,1329.5454,2,1329.6524,-0.107,0,71.42,,25,2.60E-06,R,GATQQILDEAER,S,,,,33,32.634,-0.366,0.000
TCPB_HUMAN,3,,,,,7845,1,1,665.79,1329.5654,2,1329.6524,-0.087,0,74.42,,26,1.60E-06,R,GATQQILDEAER,S,,,,32.3,32.634,0.334,0.000
TCPB_HUMAN,3,,,,,12067,1,1,665.79,1329.5654,2,1329.6524,-0.087,0,66.28,,25,9.30E-06,R,GATQQILDEAER,S,,,,33.6,32.634,-0.966,0.002
TCPB_HUMAN,3,,,,,12068,1,1,665.79,1329.5654,2,1329.6524,-0.087,0,88.06,,25,6.20E-08,R,GATQQILDEAER,S,,,,32.4,32.634,0.234,0.000
TCPB_HUMAN,3,,,,,7847,1,1,665.84,1329.6654,2,1329.6524,0.013,0,72.85,,28,4.10E-06,R,GATQQILDEAER,S,,,,33.3,32.634,-0.666,0.002
TCPB_HUMAN,3,,,,,7848,1,1,665.84,1329.6654,2,1329.6524,0.013,0,69.37,,28,9.10E-06,R,GATQQILDEAER,S,,,,33.4,32.634,-0.766,0.002
FLNA_HUMAN,4,,,,,11695,2,1,494.74,987.4654,2,987.5349,-0.0694,1,15.63,27,28,1.9,K,KGEITGEVR,M,,,,25,21.241,-3.759,0.008
FLNA_HUMAN,4,,,,,11849,1,1,550.27,1098.5254,2,1098.5669,-0.0415,0,71.22,,27,4.10E-06,K,GTVEPQLEAR,G,,,,23.4,23.796,0.396,0.000
FLNA_HUMAN,4,,,,,11850,1,1,550.27,1098.5254,2,1098.5669,-0.0415,0,52.28,,27,0.00032,K,GTVEPQLEAR,G,,,,23.8,23.796,-0.004,0.000
FLNA_HUMAN,4,,,,,11851,1,1,550.27,1098.5254,2,1098.5669,-0.0415,0,55.26,26,27,0.00016,K,GTVEPQLEAR,G,,,,23.5,23.796,0.296,0.000
FLNA_HUMAN,4,,,,,4575,1,1,550.28,1098.5454,2,1098.5669,-0.0215,0,31.36,23,32,0.14,K,GTVEPQLEAR,G,,,,24,23.796,-0.204,0.000
FLNA_HUMAN,4,,,,,4576,1,1,550.28,1098.5454,2,1098.5669,-0.0215,0,36.04,30,32,0.048,K,GTVEPQLEAR,G,,,,23.4,23.796,0.396,0.000
FLNA_HUMAN,4,,,,,11852,1,1,550.29,1098.5654,2,1098.5669,-0.0015,0,37.86,24,28,0.011,K,GTVEPQLEAR,G,,,,23.7,23.796,0.096,0.000
FLNA_HUMAN,4,,,,,4685,3,1,554.31,1106.6054,2,1106.5972,0.0083,0,4.89,17,32,53,K,LDVQFSGLTK,G,,,,33,32.057,-0.943,0.002
FLNA_HUMAN,4,,,,,6409,1,1,613.23,1224.4454,2,1224.5622,-0.1168,0,14.78,12,23,0.76,R,EATTEFSVDAR,A,,,,32.9,28.112,-4.788,0.009
FLNA_HUMAN,4,,,,,6410,1,1,613.23,1224.4454,2,1224.5622,-0.1168,0,23.45,17,23,0.1,R,EATTEFSVDAR,A,,,,29.1,28.112,-0.988,0.002
FLNA_HUMAN,4,,,,,11960,1,1,613.25,1224.4854,2,1224.5622,-0.0768,0,50.84,22,23,0.00018,R,EATTEFSVDAR,A,,,,28.4,28.112,-0.288,0.000
FLNA_HUMAN,4,,,,,11961,1,1,613.25,1224.4854,2,1224.5622,-0.0768,0,66.22,,23,5.10E-06,R,EATTEFSVDAR,A,,,,27.7,28.112,0.412,0.000
FLNA_HUMAN,4,,,,,6413,1,1,613.26,1224.5054,2,1224.5622,-0.0568,0,54.33,24,29,0.0003,R,EATTEFSVDAR,A,,,,27.7,28.112,0.412,0.000
FLNA_HUMAN,4,,,,,6416,1,1,613.27,1224.5254,2,1224.5622,-0.0368,0,46.45,26,30,0.0023,R,EATTEFSVDAR,A,,,,28.8,28.112,-0.688,0.002
FLNA_HUMAN,4,,,,,11962,1,1,613.27,1224.5254,2,1224.5622,-0.0368,0,59.42,,25,4.40E-05,R,EATTEFSVDAR,A,,,,28.1,28.112,0.012,0.000
FLNA_HUMAN,4,,,,,6417,1,1,613.28,1224.5454,2,1224.5622,-0.0168,0,51.09,23,30,0.00092,R,EATTEFSVDAR,A,,,,28.8,28.112,-0.688,0.002
FLNA_HUMAN,4,,,,,6418,1,1,613.29,1224.5654,2,1224.5622,0.0032,0,30.67,20,31,0.12,R,EATTEFSVDAR,A,,,,30.8,28.112,-2.688,0.006
FLNA_HUMAN,4,,,,,6419,1,1,613.29,1224.5654,2,1224.5622,0.0032,0,16.86,18,31,2.8,R,EATTEFSVDAR,A,,,,30.8,28.112,-2.688,0.006
FLNA_HUMAN,4,,,,,6420,1,1,613.3,1224.5854,2,1224.5622,0.0232,0,27.38,21,31,0.27,R,EATTEFSVDAR,A,,,,30.2,28.112,-2.088,0.003
FLNA_HUMAN,4,,,,,9207,1,1,721.82,1441.6254,2,1441.691,-0.0655,0,55.81,24,26,0.00012,R,AGQSAAGAAPGGGVDTR,D,,,,16.6,16.510,-0.090,0.000
FLNA_HUMAN,4,,,,,12161,1,1,721.83,1441.6454,2,1441.691,-0.0455,0,56.15,,27,0.00012,R,AGQSAAGAAPGGGVDTR,D,,,,16.5,16.510,0.010,0.000
FLNA_HUMAN,4,,,,,9369,9,1,730.87,1459.7254,2,1459.7276,-0.0021,1,2.63,16,28,43,K,VKCSGPGLSPGMVR,A,Oxidation (M),0.00000000000100.0,,24.5,27.075,2.575,0.005
HS90B_HUMAN,5,HS90B_HUMAN,327,83554,14,11983,1,1,621.81,1241.6054,2,1241.6979,-0.0925,0,66.16,27,28,1.70E-05,K,ADLINNLGTIAK,S,,,,39.8,39.800,0.000,0.000
HS90B_HUMAN,5,,,,,6644,1,1,621.83,1241.6454,2,1241.6979,-0.0525,0,6.72,16,28,16,K,ADLINNLGTIAK,S,,,,41.8,39.800,-2.000,0.003
HS90B_HUMAN,5,,,,,8133,1,1,675.32,1348.6254,2,1348.7272,-0.1018,0,96.58,21,32,4.40E-08,R,TLTLVDTGIGMTK,A,,,,41,40.907,-0.093,0.000
HS90B_HUMAN,5,,,,,8134,1,1,675.32,1348.6254,2,1348.7272,-0.1018,0,23.62,21,32,0.86,R,TLTLVDTGIGMTK,A,,,,41.4,40.907,-0.493,0.002
HS90B_HUMAN,5,,,,,12086,1,1,675.32,1348.6254,2,1348.7272,-0.1018,0,69.96,19,28,7.00E-06,R,TLTLVDTGIGMTK,A,,,,41,40.907,-0.093,0.000
HS90B_HUMAN,5,,,,,8140,1,1,675.34,1348.6654,2,1348.7272,-0.0618,0,76.88,19,33,4.80E-06,R,TLTLVDTGIGMTK,A,,,,40.9,40.907,0.007,0.000
HS90B_HUMAN,5,,,,,8141,1,1,675.35,1348.6854,2,1348.7272,-0.0418,0,67,18,33,4.80E-05,R,TLTLVDTGIGMTK,A,,,,39.8,40.907,1.107,0.002
HS90B_HUMAN,5,,,,,8142,1,1,675.36,1348.7054,2,1348.7272,-0.0218,0,67.97,21,33,3.80E-05,R,TLTLVDTGIGMTK,A,,,,39.9,40.907,1.007,0.002
HS90B_HUMAN,5,,,,,8819,1,1,704.83,1407.6454,2,1407.6881,-0.0427,1,30.59,,27,0.05,K,EKYIDQEELNK,T,,,,23.6,22.897,-0.703,0.002
HS90A_HUMAN,6,HS90A_HUMAN,327,85006,13,2836,2,1,482.18,962.3454,2,962.4127,-0.0673,0,1.07,11,25,26,R,TDTGEPMGR,G,,,,15.2,20.000,4.800,0.009
HS90A_HUMAN,6,,,,,11983,1,0,621.81,1241.6054,2,1241.6979,-0.0925,0,66.16,27,28,1.70E-05,K,ADLINNLGTIAK,S,,,,39.8,39.800,0.000,0.000
HS90A_HUMAN,6,,,,,6644,1,0,621.83,1241.6454,2,1241.6979,-0.0525,0,6.72,16,28,16,K,ADLINNLGTIAK,S,,,,41.8,39.800,-2.000,0.003
HS90A_HUMAN,6,,,,,8133,1,0,675.32,1348.6254,2,1348.7272,-0.1018,0,96.58,21,32,4.40E-08,R,TLTIVDTGIGMTK,A,,,,41,40.907,-0.093,0.000
HS90A_HUMAN,6,,,,,8134,1,0,675.32,1348.6254,2,1348.7272,-0.1018,0,23.62,21,32,0.86,R,TLTIVDTGIGMTK,A,,,,41.4,40.907,-0.493,0.002
HS90A_HUMAN,6,,,,,12086,1,0,675.32,1348.6254,2,1348.7272,-0.1018,0,69.96,19,28,7.00E-06,R,TLTIVDTGIGMTK,A,,,,41,40.907,-0.093,0.000
HS90A_HUMAN,6,,,,,8140,1,0,675.34,1348.6654,2,1348.7272,-0.0618,0,76.88,19,33,4.80E-06,R,TLTIVDTGIGMTK,A,,,,40.9,40.907,0.007,0.000
HS90A_HUMAN,6,,,,,8141,1,0,675.35,1348.6854,2,1348.7272,-0.0418,0,67,18,33,4.80E-05,R,TLTIVDTGIGMTK,A,,,,39.8,40.907,1.107,0.002
HS90A_HUMAN,6,,,,,8142,1,0,675.36,1348.7054,2,1348.7272,-0.0218,0,67.97,21,33,3.80E-05,R,TLTIVDTGIGMTK,A,,,,39.9,40.907,1.007,0.002
HS90A_HUMAN,6,,,,,8819,1,0,704.83,1407.6454,2,1407.6881,-0.0427,1,30.59,,27,0.05,K,EKYIDQEELNK,T,,,,23.6,22.897,-0.703,0.002
TCPQ_HUMAN,7,TCPQ_HUMAN,321,60153,9,6508,1,1,617.24,1232.4654,2,1232.5707,-0.1052,0,73.27,,25,1.80E-06,K,GEENLMDAQVK,A,,,,28.4,28.408,0.008,0.000
TCPQ_HUMAN,7,,,,,6509,1,1,617.24,1232.4654,2,1232.5707,-0.1052,0,82.47,,25,2.20E-07,K,GEENLMDAQVK,A,,,,28.4,28.408,0.008,0.000
TCPQ_HUMAN,7,,,,,6514,1,1,617.32,1232.6254,2,1232.5707,0.0548,0,19.79,23,33,2.6,K,GEENLMDAQVK,A,,,,29.5,28.408,-1.092,0.002
TCPQ_HUMAN,7,,,,,8341,1,1,683.28,1364.5454,2,1364.5878,-0.0424,0,71.33,,28,5.20E-06,R,GSTDNLMDDIER,A,,,,38.4,37.405,-0.995,0.002
TCPQ_HUMAN,7,,,,,8342,1,1,683.28,1364.5454,2,1364.5878,-0.0424,0,61.65,27,28,4.80E-05,R,GSTDNLMDDIER,A,,,,38.5,37.405,-1.095,0.002
TCPQ_HUMAN,7,,,,,12096,1,1,683.28,1364.5454,2,1364.5878,-0.0424,0,89.71,,24,2.90E-08,R,GSTDNLMDDIER,A,,,,37.4,37.405,0.005,0.000
TCPQ_HUMAN,7,,,,,12097,1,1,683.29,1364.5654,2,1364.5878,-0.0224,0,85.51,,25,1.00E-07,R,GSTDNLMDDIER,A,,,,37.3,37.405,0.105,0.000
ERO1A_HUMAN,8,,,,,9783,1,1,753.32,1504.6254,2,1504.7257,-0.1002,0,19.39,21,29,1.1,R,LGAVDESLSEETQK,A,,,,31.8,28.409,-3.391,0.006
ERO1A_HUMAN,8,,,,,9785,1,1,753.33,1504.6454,2,1504.7257,-0.0802,0,35.02,17,30,0.038,R,LGAVDESLSEETQK,A,,,,30.6,28.409,-2.191,0.003
ERO1A_HUMAN,8,,,,,12207,1,1,753.33,1504.6454,2,1504.7257,-0.0802,0,103.95,22,26,1.80E-09,R,LGAVDESLSEETQK,A,,,,28.6,28.409,-0.191,0.000
ERO1A_HUMAN,8,,,,,12208,1,1,753.33,1504.6454,2,1504.7257,-0.0802,0,91.51,,26,3.20E-08,R,LGAVDESLSEETQK,A,,,,28.5,28.409,-0.091,0.000
ERO1A_HUMAN,8,,,,,9788,1,1,753.35,1504.6854,2,1504.7257,-0.0402,0,96.81,22,31,3.20E-08,R,LGAVDESLSEETQK,A,,,,28.4,28.409,0.009,0.000
ERO1A_HUMAN,8,,,,,9789,1,1,753.35,1504.6854,2,1504.7257,-0.0402,0,79.72,22,31,1.60E-06,R,LGAVDESLSEETQK,A,,,,28.4,28.409,0.009,0.000
ERO1A_HUMAN,8,,,,,9790,1,1,753.36,1504.7054,2,1504.7257,-0.0202,0,25.9,20,32,0.42,R,LGAVDESLSEETQK,A,,,,30.9,28.409,-2.491,0.005
ERO1A_HUMAN,8,,,,,9792,1,1,753.38,1504.7454,2,1504.7257,0.0198,0,19.38,15,32,2.1,R,LGAVDESLSEETQK,A,,,,33.3,28.409,-4.891,0.009
VIME_HUMAN,9,VIME_HUMAN,295,53676,39,232,1,1,323.15,644.2854,2,644.3493,-0.0639,0,30.74,,29,0.068,R,LDLER,K,,,,22.6,19.561,-3.039,0.006
VIME_HUMAN,9,,,,,2275,1,1,457.73,913.4454,2,913.4505,-0.0051,0,9.32,13,27,6,R,SYVTTSTR,T,,,,19.3,19.800,0.500,0.002
VIME_HUMAN,9,,,,,11448,1,1,457.73,913.4454,2,913.4505,-0.0051,0,18.07,,27,0.79,R,SYVTTSTR,T,,,,17,19.800,2.800,0.006
VIME_HUMAN,9,,,,,11449,1,1,457.73,913.4454,2,913.4505,-0.0051,0,23.18,19,27,0.24,R,SYVTTSTR,T,,,,16,19.800,3.800,0.008
VIME_HUMAN,9,,,,,11450,1,1,457.74,913.4654,2,913.4505,0.0149,0,15.48,21,27,1.6,R,SYVTTSTR,T,,,,17.1,19.800,2.700,0.006
VIME_HUMAN,9,,,,,11451,1,1,457.75,913.4854,2,913.4505,0.0349,0,34.79,25,28,0.023,R,SYVTTSTR,T,,,,15.9,19.800,3.900,0.008
VIME_HUMAN,9,,,,,11452,1,1,457.76,913.5054,2,913.4505,0.0549,0,22.61,,28,0.39,R,SYVTTSTR,T,,,,18.1,19.800,1.700,0.003
VIME_HUMAN,9,,,,,11453,10,1,457.76,913.5054,2,913.4505,0.0549,0,2.59,17,28,39,R,SYVTTSTR,T,,,,19.8,19.800,-0.000,0.000
VIME_HUMAN,9,,,,,11454,1,1,457.77,913.5254,2,913.4505,0.0749,0,16.9,19,28,1.4,R,SYVTTSTR,T,,,,18.2,19.800,1.600,0.002
VIME_HUMAN,9,,,,,11455,1,1,457.77,913.5254,2,913.4505,0.0749,0,12.93,14,28,3.5,R,SYVTTSTR,T,,,,18.3,19.800,1.500,0.002
VIME_HUMAN,9,,,,,11789,5,1,530.74,1059.4654,2,1059.556,-0.0906,1,2.72,14,27,30,R,KLLEGEESR,I,,,,17.5,22.283,4.783,0.009
VIME_HUMAN,9,,,,,6799,1,1,627.76,1253.5054,2,1253.5598,-0.0543,0,71.86,,25,2.10E-06,R,LGDLYEEEMR,E,,,,34.2,34.198,-0.002,0.000
VIME_HUMAN,9,,,,,6800,1,1,627.77,1253.5254,2,1253.5598,-0.0343,0,17.84,12,25,0.6,R,LGDLYEEEMR,E,,,,35.3,34.198,-1.102,0.002
VIME_HUMAN,9,,,,,11996,1,1,627.77,1253.5254,2,1253.5598,-0.0343,0,80.29,,25,3.10E-07,R,LGDLYEEEMR,E,,,,34.3,34.198,-0.102,0.000
VIME_HUMAN,9,,,,,12024,2,1,644.29,1286.5654,2,1286.6579,-0.0924,1,12.76,23,26,2.2,R,QVDQLTNDKAR,V,,,,15.6,19.401,3.801,0.008
VIME_HUMAN,9,,,,,12025,1,1,429.91,1286.7082,3,1286.6579,0.0503,1,24,26,28,0.28,R,QVDQLTNDKAR,V,,,,16.6,19.401,2.801,0.006
VIME_HUMAN,9,,,,,10457,1,1,794.33,1586.6454,2,1586.79,-0.1445,1,23.23,15,29,0.45,R,TNEKVELQELNDR,F,,,,31.1,28.593,-2.507,0.005
VIME_HUMAN,9,,,,,12236,1,1,529.92,1586.7382,3,1586.79,-0.0518,1,44.07,,28,0.0028,R,TNEKVELQELNDR,F,,,,29.1,28.593,-0.507,0.002
VIME_HUMAN,9,,,,,10460,1,1,794.38,1586.7454,2,1586.79,-0.0445,1,47.75,30,32,0.0031,R,TNEKVELQELNDR,F,,,,30,28.593,-1.407,0.002
VIME_HUMAN,9,,,,,12237,1,1,794.38,1586.7454,2,1586.79,-0.0445,1,65.68,,28,2.00E-05,R,TNEKVELQELNDR,F,,,,28.1,28.593,0.493,0.002
VIME_HUMAN,9,,,,,12238,1,1,794.38,1586.7454,2,1586.79,-0.0445,1,82.46,,28,4.10E-07,R,TNEKVELQELNDR,F,,,,28.2,28.593,0.393,0.000
VIME_HUMAN,9,,,,,12239,1,1,529.93,1586.7682,3,1586.79,-0.0218,1,45.57,24,28,0.0021,R,TNEKVELQELNDR,F,,,,28.6,28.593,-0.007,0.000
VIME_HUMAN,9,,,,,12241,1,1,529.95,1586.8282,3,1586.79,0.0382,1,24.07,24,28,0.3,R,TNEKVELQELNDR,F,,,,30.9,28.593,-2.307,0.005
VIME_HUMAN,9,,,,,12242,1,1,529.95,1586.8282,3,1586.79,0.0382,1,21.57,20,28,0.54,R,TNEKVELQELNDR,F,,,,30.8,28.593,-2.207,0.003
VIME_HUMAN,9,,,,,4002,1,1,529.96,1586.8582,3,1586.79,0.0682,1,24.12,16,28,0.29,R,TNEKVELQELNDR,F,,,,27.9,28.593,0.693,0.002
VIME_HUMAN,9,,,,,12243,1,1,529.97,1586.8882,3,1586.79,0.0982,1,49.77,,28,0.00075,R,TNEKVELQELNDR,F,,,,28,28.593,0.593,0.002
VIME_HUMAN,9,,,,,12299,4,1,606.5,2421.9709,4,2422.0997,-0.1288,1,0.47,11,24,26,K,TVETRDGQVINETSQHHDDLE,-,,,,24.7,25.613,0.913,0.002
VIME_HUMAN,9,,,,,12300,1,1,606.51,2422.0109,4,2422.0997,-0.0888,1,11.65,18,26,2.8,K,TVETRDGQVINETSQHHDDLE,-,,,,27.3,25.613,-1.687,0.003
HS904_HUMAN,10,,,,,8133,1,0,675.32,1348.6254,2,1348.7272,-0.1018,0,96.58,21,32,4.40E-08,R,TLTIVDTGIGMTK,A,,,,41,40.907,-0.093,0.000
HS904_HUMAN,10,,,,,8134,1,0,675.32,1348.6254,2,1348.7272,-0.1018,0,23.62,21,32,0.86,R,TLTIVDTGIGMTK,A,,,,41.4,40.907,-0.493,0.002
HS904_HUMAN,10,,,,,12086,1,0,675.32,1348.6254,2,1348.7272,-0.1018,0,69.96,19,28,7.00E-06,R,TLTIVDTGIGMTK,A,,,,41,40.907,-0.093,0.000
HS904_HUMAN,10,,,,,8140,1,0,675.34,1348.6654,2,1348.7272,-0.0618,0,76.88,19,33,4.80E-06,R,TLTIVDTGIGMTK,A,,,,40.9,40.907,0.007,0.000
HS904_HUMAN,10,,,,,8141,1,0,675.35,1348.6854,2,1348.7272,-0.0418,0,67,18,33,4.80E-05,R,TLTIVDTGIGMTK,A,,,,39.8,40.907,1.107,0.002
HS904_HUMAN,10,,,,,8142,1,0,675.36,1348.7054,2,1348.7272,-0.0218,0,67.97,21,33,3.80E-05,R,TLTIVDTGIGMTK,A,,,,39.9,40.907,1.007,0.002
ATPD_HUMAN,11,ATPD_HUMAN,277,17479,4,9106,1,1,716.3,1430.5854,2,1430.7001,-0.1147,0,57.1,19,28,0.00015,K,AQAELVGTADEATR,A,,,,27,26.798,-0.202,0.000
ATPD_HUMAN,11,,,,,9109,1,1,716.33,1430.6454,2,1430.7001,-0.0547,0,88.59,25,31,2.10E-07,K,AQAELVGTADEATR,A,,,,26.8,26.798,-0.002,0.000
ATPD_HUMAN,11,,,,,9110,1,1,716.33,1430.6454,2,1430.7001,-0.0547,0,117.07,,31,3.00E-10,K,AQAELVGTADEATR,A,,,,25.7,26.798,1.098,0.002
ATPD_HUMAN,11,,,,,12152,1,1,716.33,1430.6454,2,1430.7001,-0.0547,0,99.96,,27,6.20E-09,K,AQAELVGTADEATR,A,,,,25.7,26.798,1.098,0.002
RS21_HUMAN,12,,,,,4872,1,1,561.71,1121.4054,2,1121.5023,-0.0968,0,60.05,,23,2.30E-05,R,MGESDDSILR,L,,,,29.7,29.238,-0.462,0.000
RS21_HUMAN,12,,,,,11870,1,1,561.73,1121.4454,2,1121.5023,-0.0568,0,90.4,,24,2.40E-08,R,MGESDDSILR,L,,,,28.4,29.238,0.838,0.002
RS21_HUMAN,12,,,,,11871,1,1,561.74,1121.4654,2,1121.5023,-0.0368,0,51.99,24,25,0.00023,R,MGESDDSILR,L,,,,29.4,29.238,-0.162,0.000
RS21_HUMAN,12,,,,,11872,1,1,561.74,1121.4654,2,1121.5023,-0.0368,0,94.75,,25,1.20E-08,R,MGESDDSILR,L,,,,28.3,29.238,0.938,0.002
RS21_HUMAN,12,,,,,4873,1,1,561.75,1121.4854,2,1121.5023,-0.0168,0,53.83,20,26,0.0002,R,MGESDDSILR,L,,,,29.8,29.238,-0.562,0.002
RS21_HUMAN,12,,,,,4874,1,1,561.75,1121.4854,2,1121.5023,-0.0168,0,17.65,20,26,0.83,R,MGESDDSILR,L,,,,33.8,29.238,-4.562,0.009
RS21_HUMAN,12,,,,,4875,1,1,561.76,1121.5054,2,1121.5023,0.0032,0,38.03,20,27,0.0086,R,MGESDDSILR,L,,,,29.5,29.238,-0.262,0.000
K1C10_HUMAN,13,,,,,8345,1,1,683.3,1364.5854,2,1364.632,-0.0466,0,21.61,21,30,0.78,R,SQYEQLAEQNR,K,,,,24.6,24.301,-0.299,0.000
K1C10_HUMAN,13,,,,,8506,1,1,691.29,1380.5654,2,1380.6408,-0.0754,0,60.67,16,29,8.40E-05,R,ALEESNYELEGK,I,,,,29.2,28.110,-1.090,0.002
K1C10_HUMAN,13,,,,,8509,1,1,691.3,1380.5854,2,1380.6408,-0.0554,0,89.55,20,31,1.40E-07,R,ALEESNYELEGK,I,,,,28.1,28.110,0.010,0.000
K1C10_HUMAN,13,,,,,8510,1,1,691.3,1380.5854,2,1380.6408,-0.0554,0,69.62,18,31,1.40E-05,R,ALEESNYELEGK,I,,,,29.2,28.110,-1.090,0.002
K1C10_HUMAN,13,,,,,12111,1,1,691.3,1380.5854,2,1380.6408,-0.0554,0,77.86,21,26,6.80E-07,R,ALEESNYELEGK,I,,,,28.1,28.110,0.010,0.000
K1C10_HUMAN,13,,,,,12112,1,1,691.34,1380.6654,2,1380.6408,0.0246,0,0.54,10,28,58,R,ALEESNYELEGK,I,,,,29.9,28.110,-1.790,0.003
MYH9_HUMAN,14,,,,,2074,3,1,445.27,888.5254,2,888.5644,-0.0389,1,21.08,,33,1.8,K,LSLSTKLK,Q,,,,23.3,24.227,0.927,0.002
MYH9_HUMAN,14,,,,,11685,1,1,493.75,985.4854,2,985.5556,-0.0702,1,6.42,14,28,15,K,GALALEEKR,R,,,,26.2,24.324,-1.876,0.003
MYH9_HUMAN,14,,,,,11686,4,1,493.75,985.4854,2,985.5556,-0.0702,1,6.76,20,28,14,K,GALALEEKR,R,,,,26.2,24.324,-1.876,0.003
MYH9_HUMAN,14,,,,,11687,1,1,493.77,985.5254,2,985.5556,-0.0302,1,24.96,,28,0.25,K,GALALEEKR,R,,,,24.9,24.324,-0.576,0.002
MYH9_HUMAN,14,,,,,11689,5,1,493.78,985.5454,2,985.5556,-0.0102,1,2.89,15,29,41,K,GALALEEKR,R,,,,25.7,24.324,-1.376,0.002
MYH9_HUMAN,14,,,,,3866,1,1,524.72,1047.4254,2,1047.4906,-0.0652,0,15.49,19,24,0.79,R,ALEEAMEQK,A,,,,22.3,25.430,3.130,0.006
MYH9_HUMAN,14,,,,,3867,1,1,524.73,1047.4454,2,1047.4906,-0.0452,0,57.33,,26,7.90E-05,R,ALEEAMEQK,A,,,,21.9,25.430,3.530,0.006
MYH9_HUMAN,14,,,,,3868,1,1,524.75,1047.4854,2,1047.4906,-0.0052,0,34.88,23,28,0.021,R,ALEEAMEQK,A,,,,21.8,25.430,3.630,0.006
MYH9_HUMAN,14,,,,,4595,8,1,550.8,1099.5854,2,1099.6237,-0.0382,1,1.34,15,29,59,R,EQEVNILKK,T,,,,24,23.630,-0.370,0.000
MYH9_HUMAN,14,,,,,6093,1,1,602.76,1203.5054,2,1203.5805,-0.0751,0,29.39,21,25,0.043,R,ALEQQVEEMK,T,,,,31.4,29.296,-2.104,0.003
MYH9_HUMAN,14,,,,,6096,1,1,602.78,1203.5454,2,1203.5805,-0.0351,0,25.58,20,27,0.16,R,ALEQQVEEMK,T,,,,30.5,29.296,-1.204,0.002
MYH9_HUMAN,14,,,,,6097,1,1,602.79,1203.5654,2,1203.5805,-0.0151,0,65.83,26,28,1.70E-05,R,ALEQQVEEMK,T,,,,29.3,29.296,-0.004,0.000
MYH9_HUMAN,14,,,,,11946,1,1,602.79,1203.5654,2,1203.5805,-0.0151,0,36.35,,28,0.015,R,ALEQQVEEMK,T,,,,30.4,29.296,-1.104,0.002
MYH9_HUMAN,14,,,,,6098,1,1,602.8,1203.5854,2,1203.5805,0.0049,0,20.7,14,28,0.62,R,ALEQQVEEMK,T,,,,32.4,29.296,-3.104,0.006
MYH9_HUMAN,14,,,,,6182,1,1,606.77,1211.5254,2,1211.5782,-0.0528,0,10.41,11,25,3.3,K,DLEAHIDSANK,N,,,,22.3,26.477,4.177,0.009
MYH9_HUMAN,14,,,,,6183,3,1,606.78,1211.5454,2,1211.5782,-0.0328,0,1.32,13,26,33,K,DLEAHIDSANK,N,,,,22.5,26.477,3.977,0.008
MYH9_HUMAN,14,,,,,6641,8,1,621.79,1241.5654,2,1241.684,-0.1185,2,4.6,22,27,18,K,NRDEAIKQLR,K,,,,26.8,25.584,-1.216,0.002
MYH9_HUMAN,14,,,,,6642,8,1,621.8,1241.5854,2,1241.684,-0.0985,2,7.94,,27,10,K,NRDEAIKQLR,K,,,,26.9,25.584,-1.316,0.002
MYH9_HUMAN,14,,,,,8124,1,1,674.85,1347.6854,2,1347.6154,0.0701,0,19.04,16,28,0.96,R,DELADEIANSSGK,G,,,,31.9,31.423,-0.477,0.002
MYH9_HUMAN,14,,,,,12159,1,1,480.87,1439.5882,3,1439.7004,-0.1123,1,7.74,15,24,4.9,K,DLEGLSQRHEEK,V,,,,20.3,24.514,4.214,0.009
MYH9_HUMAN,14,,,,,10196,1,1,776.3,1550.5854,2,1550.6882,-0.1028,0,66.46,17,26,9.90E-06,R,EDQSILCTGESGAGK,T,,,,26.7,26.709,0.009,0.000
MYH9_HUMAN,14,,,,,10197,1,1,776.33,1550.6454,2,1550.6882,-0.0428,0,65.29,22,30,3.30E-05,R,EDQSILCTGESGAGK,T,,,,26.8,26.709,-0.091,0.000
MYH9_HUMAN,14,,,,,5074,8,1,568.31,1701.9082,3,1701.989,-0.0808,2,0.18,14,31,1.50E+02,K,KAGKLDPHLVLDQLR,C,,,,21.4,24.302,2.902,0.006
MYH9_HUMAN,14,,,,,11281,1,1,880.91,1759.8054,2,1759.8298,-0.0243,0,34.34,14,28,0.026,K,LEEEQIILEDQNCK,L,,,,35.1,36.147,1.047,0.002
MYH9_HUMAN,14,,,,,12298,2,1,563.99,2251.9309,4,2252.059,-0.1281,2,3.89,14,25,16,R,EDQSILCTGESGAGKTENTKK,V,,,,22.6,22.891,0.291,0.000
ANX11_HUMAN,15,,,,,11683,7,1,492.8,983.5854,2,983.544,0.0415,2,4.38,19,27,19,R,AYKAEFKK,T,,,,20.3,17.012,-3.288,0.006
ANX11_HUMAN,15,,,,,7959,1,1,668.76,1335.5054,2,1335.6055,-0.1,0,66.9,21,26,8.10E-06,R,DAQELYAAGENR,L,,,,26.3,26.610,0.310,0.000
ANX11_HUMAN,15,,,,,7960,1,1,668.76,1335.5054,2,1335.6055,-0.1,0,81.89,23,26,2.60E-07,R,DAQELYAAGENR,L,,,,26.4,26.610,0.210,0.000
ANX11_HUMAN,15,,,,,12070,1,1,668.77,1335.5254,2,1335.6055,-0.08,0,60.67,20,23,2.00E-05,R,DAQELYAAGENR,L,,,,26.7,26.610,-0.090,0.000